Target
Tyrosine-protein kinase BTK
Ligand
BDBM390072
Substrate
Meas. Tech.
Kinase Assay
IC50
505±n/a nM
Citation
 Liu, DZhang, MHu, Q Aminopyridazinone compounds as protein kinase inhibitors US Patent  US9951077 Publication Date 4/24/2018 
Target
Name:
Tyrosine-protein kinase BTK
Synonyms:
AGMX1 Agammaglobulinaemia tyrosine kinase B cell progenitor kinase BPK BTK_HUMAN Tyrosine Kinase BTK Tyrosine-protein kinase BTK (BTK)
Type:
Enzyme
Mol. Mass.:
76289.95
Organism:
Homo sapiens (Human)
Description:
Q06187
Residue:
659
  
Inhibitor
Name:
BDBM390072
Synonyms:
US10323037, Example 85 | US9951077, 85
Type:
Small organic molecule
Emp. Form.:
C24H21FN6O2
Mol. Mass.:
444.4609
SMILES:
Nc1n[nH]c(=O)c2n(cc(-c3ccc(Oc4ccccc4)c(F)c3)c12)[C@@H]1CCCN(C1)C#N
: