Target
Tyrosine-protein kinase BTK
Ligand
BDBM390077
Substrate
Meas. Tech.
Kinase Assay
IC50
505±n/a nM
Citation
 Liu, DZhang, MHu, Q Aminopyridazinone compounds as protein kinase inhibitors US Patent  US9951077 Publication Date 4/24/2018 
Target
Name:
Tyrosine-protein kinase BTK
Synonyms:
AGMX1 Agammaglobulinaemia tyrosine kinase B cell progenitor kinase BPK BTK_HUMAN Tyrosine Kinase BTK Tyrosine-protein kinase BTK (BTK)
Type:
Enzyme
Mol. Mass.:
76289.95
Organism:
Homo sapiens (Human)
Description:
Q06187
Residue:
659
  
Inhibitor
Name:
BDBM390077
Synonyms:
US9951077, 89
Type:
Small organic molecule
Emp. Form.:
C22H18ClN5O3
Mol. Mass.:
435.863
SMILES:
COc1ccc(cc1Cl)-c1cn(-c2cccc(NC(=O)C=C)c2)c2c1c(N)n[nH]c2=O
: