Target
Interleukin-1 receptor-associated kinase 4
Ligand
BDBM390409
Substrate
Meas. Tech.
Kinase Assay
IC50
8.00±n/a nM
Citation
 Bothe, USiebeneicher, HSchmidt, NRotgeri, ABömer, URing, SIrlbacher, HGünther, JSteuber, HLange, MSchäfer, M Indazolecarboxamides, processes for their preparation, pharmaceutical preparations comprising them and their use for producing medicaments US Patent  US9951086 Publication Date 4/24/2018 
Target
Name:
Interleukin-1 receptor-associated kinase 4
Synonyms:
IRAK-4 IRAK4_HUMAN Interleukin-1 receptor-associated kinase 4 (IRAK4) | Renal carcinoma antigen NY-REN-64
Type:
Protein
Mol. Mass.:
51519.08
Organism:
Homo sapiens (Human)
Description:
Q9NWZ3
Residue:
460
  
Inhibitor
Name:
BDBM390409
Synonyms:
US9951086, Example 296
Type:
Small organic molecule
Emp. Form.:
C25H26F3N5O4
Mol. Mass.:
517.5002
SMILES:
FC(F)(F)c1cccc(n1)C(=O)Nc1cc2cn(CC(=O)N3CCOCC3)nc2cc1OCC1CCC1
: