Target
Interleukin-1 receptor-associated kinase 4
Ligand
BDBM390413
Substrate
Meas. Tech.
Kinase Assay
IC50
4.00±n/a nM
Citation
 Bothe, USiebeneicher, HSchmidt, NRotgeri, ABömer, URing, SIrlbacher, HGünther, JSteuber, HLange, MSchäfer, M Indazolecarboxamides, processes for their preparation, pharmaceutical preparations comprising them and their use for producing medicaments US Patent  US9951086 Publication Date 4/24/2018 
Target
Name:
Interleukin-1 receptor-associated kinase 4
Synonyms:
IRAK-4 IRAK4_HUMAN Interleukin-1 receptor-associated kinase 4 (IRAK4) | Renal carcinoma antigen NY-REN-64
Type:
Protein
Mol. Mass.:
51519.08
Organism:
Homo sapiens (Human)
Description:
Q9NWZ3
Residue:
460
  
Inhibitor
Name:
BDBM390413
Synonyms:
US9951086, Example 300
Type:
Small organic molecule
Emp. Form.:
C23H24F3N5O5
Mol. Mass.:
507.4624
SMILES:
OCCCOc1cc2nn(CC(=O)N3CCOCC3)cc2cc1NC(=O)c1cccc(n1)C(F)(F)F
: