Target
Histone deacetylase 6
Ligand
BDBM50398725
Substrate
Meas. Tech.
Inhibition Assay
IC50
2.38±0.38 nM
Citation
 Sotomayor, EMBergman, JKozikowski, AWoan, KVVillagra, AV Selective histone deactylase 6 inhibitors US Patent  US9956192 Publication Date 5/1/2018 
Target
Name:
Histone deacetylase 6
Synonyms:
Cereblon/Histone deacetylase 6 HDAC6 Histone deacetylase 6 (HDAC6) KIAA0901 | ORF Names:JM21
Type:
Chromatin regulator; hydrolase; repressor
Mol. Mass.:
131381.51
Organism:
Homo sapiens (Human)
Description:
Q9UBN7
Residue:
1215
  
Inhibitor
Name:
BDBM50398725
Synonyms:
CHEMBL2179249 US9409858, 5b US9956192, Compound 5b
Type:
Small organic molecule
Emp. Form.:
C19H23N3O5
Mol. Mass.:
373.403
SMILES:
COc1ccccc1NC(=O)N(CCCO)Cc1ccc(cc1)C(=O)NO
: