Target
Gag-Pol polyprotein [588-1027,K691N,Y769C]/[588-1147,K691N,Y769C]
Ligand
BDBM27602
Substrate
poly rC/biotin-dG15
Meas. Tech.
Reverse Transcriptase Assay
IC50
22±n/a nM
Citation
 Gagnon, ALandry, SCoulombe, RJakalian, AGuse, IThavonekham, BBonneau, PRYoakim, CSimoneau, B Investigation on the role of the tetrazole in the binding of thiotetrazolylacetanilides with HIV-1 wild type and K103N/Y181C double mutant reverse transcriptases. Bioorg Med Chem Lett 19:1199-205 (2009)  
Target
Name:
Gag-Pol polyprotein [588-1027,K691N,Y769C]/[588-1147,K691N,Y769C]
Synonyms:
HIV-1 Reverse Transcriptase Mutant (103N/181C)
Type:
Protein Complex
Mol. Mass.:
Description:
Components:
This complex has 2 components.
Component 1
Name:
Gag-Pol polyprotein [588-1147,K691N,Y769C]
Synonyms:
HIV-1 Reverse Transcriptase Mutant (103N/181C) Chain A gag-pol
Type:
Enzyme Subunit
Mol. Mass.:
64411.30
Organism:
Human immunodeficiency virus type 1
Description:
P04585[588-1147,K691N,Y769C]
Residue:
560
  
Component 2
Name:
Gag-Pol polyprotein [588-1027,K691N,Y769C]
Synonyms:
HIV-1 Reverse Transcriptase Mutant (103N/181C) Chain B gag-pol
Type:
Enzyme Subunit
Mol. Mass.:
51262.02
Organism:
Human immunodeficiency virus type 1
Description:
P04585[588-1027,K691N,Y769C]
Residue:
440
  
Inhibitor
Name:
BDBM27602
Synonyms:
2-{4-[4-(2-{[4-(4-tert-butyl-2-chlorophenyl)-5-methyl-1H-pyrazol-3-yl]oxy}acetamido)-3-chlorophenyl]phenyl}acetic acid | pyrazolyl compound, 40
Type:
Small organic molecule
Emp. Form.:
C30H29Cl2N3O4
Mol. Mass.:
566.475
SMILES:
Cc1[nH]nc(OCC(=O)Nc2ccc(cc2Cl)-c2ccc(CC(O)=O)cc2)c1-c1ccc(cc1Cl)C(C)(C)C
:
Substrate
Name:
poly rC/biotin-dG15
Synonyms:
Type:
RNA/DNA duplex
Mol. Mass.:
358.43
Organism:
Description:
The incorporation of [3H]dGTP onto a (poly)rC:(biotin)dG template:primer.
Residue:
3
NA