Target
Macrophage colony-stimulating factor 1 receptor
Ligand
BDBM27639
Substrate
Biotinylated substrate peptide
Meas. Tech.
Kinase Inhibition Assay
pH
7.5±n/a
Temperature
310.15±n/a K
IC50
11±n/a nM
Citation
 Burns, CJHarte, MFBu, XFantino, EGiarrusso, MJoffe, MKurek, MLegge, FSRazzino, PSu, STreutlein, HWan, SSZeng, JWilks, AF Discovery of 2-(alpha-methylbenzylamino) pyrazines as potent Type II inhibitors of FMS. Bioorg Med Chem Lett 19:1206-9 (2009)  
Target
Name:
Macrophage colony-stimulating factor 1 receptor
Synonyms:
CSF1R FMS Macrophage colony stimulating factor receptor Macrophage colony-stimulating factor 1 receptor (c-FMS) Proto-oncogene c-Fms c-fms | cFMS
Type:
Protein
Mol. Mass.:
107979.48
Organism:
Homo sapiens (Human)
Description:
P07333
Residue:
972
  
Inhibitor
Name:
BDBM27639
Synonyms:
N-{3-[(1S)-1-{[6-(4-hydroxy-3-methoxyphenyl)pyrazin-2-yl]amino}ethyl]phenyl}pyridine-3-carboxamide | alpha-methylbenzylamino pyrazine deriv., (S)-1
Type:
Small organic molecule
Emp. Form.:
C25H23N5O3
Mol. Mass.:
441.4818
SMILES:
COc1cc(ccc1O)-c1cncc(N[C@@H](C)c2cccc(NC(=O)c3cccnc3)c2)n1
:
Substrate
Name:
Biotinylated substrate peptide
Synonyms:
Type:
Peptide
Mol. Mass.:
2803.42
Organism:
Description:
Residue:
23