Target
Poly [ADP-ribose] polymerase 2
Ligand
BDBM27706
Substrate
BDBM27683
Meas. Tech.
PARP Enzyme Inhibition Assay
Temperature
298.15±n/a K
IC50
610±n/a nM
Comments
extracted
Citation
 Ishida, JYamamoto, HKido, YKamijo, KMurano, KMiyake, HOhkubo, MKinoshita, TWarizaya, MIwashita, AMihara, KMatsuoka, NHattori, K Discovery of potent and selective PARP-1 and PARP-2 inhibitors: SBDD analysis via a combination of X-ray structural study and homology modeling. Bioorg Med Chem 14:1378-90 (2006)  
Target
Name:
Poly [ADP-ribose] polymerase 2
Synonyms:
2.4.2.- ADP-ribosyltransferase diphtheria toxin-like 2 ARTD2 Adprtl2 DNA ADP-ribosyltransferase PARP2 PARP-2 Parp2 Poly [ADP-ribose] polymerase 2 (Parp2) Poly[ADP-ribose] synthase 2 Protein poly-ADP-ribosyltransferase PARP2 pADPRT-2 | poly-ADP-ribose polymerase 2 (PARP2)
Type:
Mol. Mass.:
63409.97
Organism:
Mus musculus (Mouse)
Description:
Alexis Biochemicals, Cat. no. ALX-201-064-C020
Residue:
559
  
Inhibitor
Name:
BDBM27706
Synonyms:
8-chloro-2-[3-(4-phenyl-1,2,3,6-tetrahydropyridin-1-yl)propyl]-3,4-dihydroquinazolin-4-one quinazolinone analogue, 1b
Type:
Small organic molecule
Emp. Form.:
C22H22ClN3O
Mol. Mass.:
379.883
SMILES:
Clc1cccc2c1nc(CCCN1CCC(=CC1)c1ccccc1)[nH]c2=O
:
Substrate
Name:
BDBM27683
Synonyms:
[adenylate-32P]-NAD
Type:
radiolabeled substrate
Emp. Form.:
Mol. Mass.:
SMILES:
: