Target
Trace amine-associated receptor 1
Ligand
BDBM390703
Substrate
Meas. Tech.
Radioligand Binding
Ki
11.7±n/a nM
Citation
 Cecere, GGalley, GGoergler, ANorcross, RPflieger, PTirla, ASchmid, P 6-amino-5,6,7,8-tetrahydronaphthalen-2-yl or 3-aminochroman-7-yl derivatives US Patent  US9957261 Publication Date 5/1/2018 
Target
Name:
Trace amine-associated receptor 1
Synonyms:
TAAR1_MOUSE Taar1 Trace amine receptor 1 (TARR1) Trace amine-associated receptor1 | Trar1
Type:
Protein
Mol. Mass.:
37635.41
Organism:
Mus musculus (Mouse)
Description:
Q923Y8
Residue:
332
  
Inhibitor
Name:
BDBM390703
Synonyms:
(S)-N-(6-Amino-5,6,7,8-tetrahydronaphthalen-2-yl)-2-(trifluoromethyl)isonicotinamide | US9957261, Example 45
Type:
Small organic molecule
Emp. Form.:
C17H16F3N3O
Mol. Mass.:
335.3236
SMILES:
N[C@H]1CCc2cc(NC(=O)c3ccnc(c3)C(F)(F)F)ccc2C1
: