Target
Trace amine-associated receptor 1
Ligand
BDBM390709
Substrate
Meas. Tech.
Radioligand Binding
Ki
6.20±n/a nM
Citation
 Cecere, GGalley, GGoergler, ANorcross, RPflieger, PTirla, ASchmid, P 6-amino-5,6,7,8-tetrahydronaphthalen-2-yl or 3-aminochroman-7-yl derivatives US Patent  US9957261 Publication Date 5/1/2018 
Target
Name:
Trace amine-associated receptor 1
Synonyms:
TAAR1_MOUSE Taar1 Trace amine receptor 1 (TARR1) Trace amine-associated receptor1 | Trar1
Type:
Protein
Mol. Mass.:
37635.41
Organism:
Mus musculus (Mouse)
Description:
Q923Y8
Residue:
332
  
Inhibitor
Name:
BDBM390709
Synonyms:
(S)-N-(6-Amino-5,6,7,8-tetrahydronaphthalen-2-yl)-3-ethyl-4-methyl-1H-pyrazole-5-carboxamide | US9957261, Example 51
Type:
Small organic molecule
Emp. Form.:
C17H22N4O
Mol. Mass.:
298.3828
SMILES:
CCc1n[nH]c(C(=O)Nc2ccc3C[C@@H](N)CCc3c2)c1C
: