Target
Trace amine-associated receptor 1
Ligand
BDBM390724
Substrate
Meas. Tech.
Radioligand Binding
Ki
16.3±n/a nM
Citation
 Cecere, GGalley, GGoergler, ANorcross, RPflieger, PTirla, ASchmid, P 6-amino-5,6,7,8-tetrahydronaphthalen-2-yl or 3-aminochroman-7-yl derivatives US Patent  US9957261 Publication Date 5/1/2018 
Target
Name:
Trace amine-associated receptor 1
Synonyms:
TAAR1_MOUSE Taar1 Trace amine receptor 1 (TARR1) Trace amine-associated receptor1 | Trar1
Type:
Protein
Mol. Mass.:
37635.41
Organism:
Mus musculus (Mouse)
Description:
Q923Y8
Residue:
332
  
Inhibitor
Name:
BDBM390724
Synonyms:
(R)-N7-(5-(Trifluoromethyl)pyrimidin-2-yl)chroman-3,7-diamine | US9957261, Example 80
Type:
Small organic molecule
Emp. Form.:
C14H13F3N4O
Mol. Mass.:
310.2744
SMILES:
N[C@H]1COc2cc(Nc3ncc(cn3)C(F)(F)F)ccc2C1
: