Target
Trace amine-associated receptor 1
Ligand
BDBM390725
Substrate
Meas. Tech.
Radioligand Binding
Ki
8.20±n/a nM
Citation
 Cecere, GGalley, GGoergler, ANorcross, RPflieger, PTirla, ASchmid, P 6-amino-5,6,7,8-tetrahydronaphthalen-2-yl or 3-aminochroman-7-yl derivatives US Patent  US9957261 Publication Date 5/1/2018 
Target
Name:
Trace amine-associated receptor 1
Synonyms:
TAAR1_MOUSE Taar1 Trace amine receptor 1 (TARR1) Trace amine-associated receptor1 | Trar1
Type:
Protein
Mol. Mass.:
37635.41
Organism:
Mus musculus (Mouse)
Description:
Q923Y8
Residue:
332
  
Inhibitor
Name:
BDBM390725
Synonyms:
(R)-N-(3-Aminochroman-7-yl)-5-ethoxy-4-methyl-1H-pyrazole-3-carboxamide | US9957261, Example 81
Type:
Small organic molecule
Emp. Form.:
C16H20N4O3
Mol. Mass.:
316.355
SMILES:
CCOc1[nH]nc(C(=O)Nc2ccc3C[C@@H](N)COc3c2)c1C
: