Target
Tyrosine-protein kinase JAK1
Ligand
BDBM391102
Substrate
Meas. Tech.
Biochemical HTRF Assay
IC50
0.060±n/a nM
Citation
 Childers, MLFuller, PGuerin, DKatz, JDPu, QScott, METhompson, CFMartinez, MFalcone, DTorres, LDeng, YKurukulasuriya, RZeng, HBai, YKong, NLiu, YZheng, Z Geminally substituted cyanoethylpyrazolo pyridones as Janus kinase inhibitors US Patent  US9957264 Publication Date 5/1/2018 
Target
Name:
Tyrosine-protein kinase JAK1
Synonyms:
JAK-1 JAK1A JAK1_HUMAN Janus kinase 1 (JAK1) | Janus kinase 1 JAK1
Type:
Protein
Mol. Mass.:
133293.73
Organism:
Homo sapiens (Human)
Description:
P23458
Residue:
1154
  
Inhibitor
Name:
BDBM391102
Synonyms:
US9957264, Example 5-173 {(1R,2R)-1-[3-({4-[(1R or 1S)-1-(ethylamino)-2,2,2- trifluoroethyl]phenyl} amino)-4-oxo-4,5- dihydro-1H-pyrazolo [4,3-c]pyridin-1-yl]-2- fluorocyclohexyl} acetonitrile (from I-19A. Derived from Peak A via SFC on pyridone: AS-H, 20% MEOH + 0.25% DMEA in CO2, Tr = 4.4 minutes)
Type:
Small organic molecule
Emp. Form.:
C24H26F4N6O
Mol. Mass.:
490.4965
SMILES:
CCNC(c1ccc(Nc2nn(c3cc[nH]c(=O)c23)[C@@]2(CC#N)CCCC[C@H]2F)cc1)C(F)(F)F
: