Target
Tyrosine-protein kinase JAK2
Ligand
BDBM391348
Substrate
Meas. Tech.
Biochemical HTRF Assay
IC50
0.060±n/a nM
Citation
 Childers, MLFuller, PGuerin, DKatz, JDPu, QScott, METhompson, CFMartinez, MFalcone, DTorres, LDeng, YKurukulasuriya, RZeng, HBai, YKong, NLiu, YZheng, Z Geminally substituted cyanoethylpyrazolo pyridones as Janus kinase inhibitors US Patent  US9957264 Publication Date 5/1/2018 
Target
Name:
Tyrosine-protein kinase JAK2
Synonyms:
JAK-2 JAK2_HUMAN Janus kinase 2 (JAK2) | Janus kinase 2 (a protein tyrosine kinase)
Type:
Protein
Mol. Mass.:
130684.68
Organism:
Homo sapiens (Human)
Description:
O60674
Residue:
1132
  
Inhibitor
Name:
BDBM391348
Synonyms:
(2S,5S)-isopropyl 5-(3-((2- (tert-butyl)-1,1-dioxido- 2,3-dihydrobenzo [d]isothiazol- 5-yl)amino)-4-oxo-4,5- dihydro-1H-pyrazolo[4,3- c]pyridin-1-yl)-5- (cyanomethyl)tetrahydro- 2H-pyran-2-carboxylate | US9957264, Example 19-3
Type:
Small organic molecule
Emp. Form.:
C28H34N6O6S
Mol. Mass.:
582.671
SMILES:
CC(C)OC(=O)[C@@H]1CC[C@](CC#N)(CO1)n1nc(Nc2ccc3c(CN(C(C)(C)C)S3(=O)=O)c2)c2c1cc[nH]c2=O
: