Target
Tyrosine-protein kinase JAK1
Ligand
BDBM391439
Substrate
Meas. Tech.
Biochemical HTRF Assay
IC50
80.0±n/a nM
Citation
 Dinsmore, CFuller, PGuerin, DThompson, CFPu, QScott, MEKatz, JDKurukulasuriya, RClose, JTFalcone, DBrubaker, JZeng, HBai, YFu, JKong, NLiu, YZheng, Z N-(2-cyano heterocyclyl) pyrazolo pyridones as janus kinase inhibitors US Patent  US9957265 Publication Date 5/1/2018 
Target
Name:
Tyrosine-protein kinase JAK1
Synonyms:
JAK-1 JAK1A JAK1_HUMAN Janus kinase 1 (JAK1) | Janus kinase 1 JAK1
Type:
Protein
Mol. Mass.:
133293.73
Organism:
Homo sapiens (Human)
Description:
P23458
Residue:
1154
  
Inhibitor
Name:
BDBM391439
Synonyms:
US9957265, 1-52 | US9957265, 1-53
Type:
Small organic molecule
Emp. Form.:
C23H25F3N6O2
Mol. Mass.:
474.4788
SMILES:
CC(C)NC(c1ccc(Nc2nn([C@H]3COCC[C@@H]3C#N)c3cc[nH]c(=O)c23)cc1)C(F)(F)F
: