Target
Tyrosine-protein kinase JAK1
Ligand
BDBM391456
Substrate
Meas. Tech.
Biochemical HTRF Assay
IC50
80.0±n/a nM
Citation
 Dinsmore, CFuller, PGuerin, DThompson, CFPu, QScott, MEKatz, JDKurukulasuriya, RClose, JTFalcone, DBrubaker, JZeng, HBai, YFu, JKong, NLiu, YZheng, Z N-(2-cyano heterocyclyl) pyrazolo pyridones as janus kinase inhibitors US Patent  US9957265 Publication Date 5/1/2018 
Target
Name:
Tyrosine-protein kinase JAK1
Synonyms:
JAK-1 JAK1A JAK1_HUMAN Janus kinase 1 (JAK1) | Janus kinase 1 JAK1
Type:
Protein
Mol. Mass.:
133293.73
Organism:
Homo sapiens (Human)
Description:
P23458
Residue:
1154
  
Inhibitor
Name:
BDBM391456
Synonyms:
US9957265, 1-69
Type:
Small organic molecule
Emp. Form.:
C21H22N6O4S
Mol. Mass.:
454.502
SMILES:
O=c1[nH]ccc2n(nc(Nc3ccc(cc3)S(=O)(=O)N3CCC3)c12)[C@H]1COCC[C@@H]1C#N
: