Target
Tyrosine-protein kinase JAK2
Ligand
BDBM391487
Substrate
Meas. Tech.
Biochemical HTRF Assay
IC50
50.0±n/a nM
Citation
 Dinsmore, CFuller, PGuerin, DThompson, CFPu, QScott, MEKatz, JDKurukulasuriya, RClose, JTFalcone, DBrubaker, JZeng, HBai, YFu, JKong, NLiu, YZheng, Z N-(2-cyano heterocyclyl) pyrazolo pyridones as janus kinase inhibitors US Patent  US9957265 Publication Date 5/1/2018 
Target
Name:
Tyrosine-protein kinase JAK2
Synonyms:
JAK-2 JAK2_HUMAN Janus kinase 2 (JAK2) | Janus kinase 2 (a protein tyrosine kinase)
Type:
Protein
Mol. Mass.:
130684.68
Organism:
Homo sapiens (Human)
Description:
O60674
Residue:
1132
  
Inhibitor
Name:
BDBM391487
Synonyms:
US9957265, 1-100 | US9957265, 1-101
Type:
Small organic molecule
Emp. Form.:
C24H27N7O3
Mol. Mass.:
461.5163
SMILES:
CC(C)NC1(C)C(=O)Nc2cc(Nc3nn(C4COCC[C@@H]4C#N)c4cc[nH]c(=O)c34)ccc12
: