Target
Lethal factor
Ligand
BDBM27862
Substrate
Fluorogenic LF Substrate
Meas. Tech.
Fluorescence Peptide Cleavage Assay
pH
7±n/a
Temperature
298.15±n/a K
IC50
14100±2000 nM
Citation
 Agrawal, Ade Oliveira, CACheng, YJacobsen, JAMcCammon, JACohen, SM Thioamide Hydroxypyrothiones Supersede Amide Hydroxypyrothiones in Potency against Anthrax Lethal Factor. J Med Chem 52:1063-74 (2009)  
Target
Name:
Lethal factor
Synonyms:
Anthrax Lethal Factor (LF) Antrax lethal toxin lef | lethal factor
Type:
PROTEIN
Mol. Mass.:
93758.56
Organism:
Bacillus anthracis
Description:
ChEMBL_1460338
Residue:
809
  
Inhibitor
Name:
BDBM27862
Synonyms:
N-(diphenylmethyl)-3-hydroxy-4-sulfanylidene-4H-pyran-2-carboxamide | hydroxypyrothione amide, 4b
Type:
Small organic molecule
Emp. Form.:
C19H15NO3S
Mol. Mass.:
337.392
SMILES:
Oc1c(occc1=S)C(=O)NC(c1ccccc1)c1ccccc1
:
Substrate
Name:
Fluorogenic LF Substrate
Synonyms:
Type:
Peptide
Mol. Mass.:
6797.59
Organism:
Description:
Cou = 7-Hydroxy-4-methyl-3-acetylcoumarinyl; QSY-35 = N-((4-((7-Nitro-2,1,3-benzoxzdiazol-4-yl)amino)phenyl)acetyl.
Residue:
61