Target
Lethal factor
Ligand
BDBM27863
Substrate
Fluorogenic LF Substrate
Meas. Tech.
Fluorescence Peptide Cleavage Assay
pH
7±n/a
Temperature
298.15±n/a K
IC50
33500±2300 nM
Citation
 Agrawal, Ade Oliveira, CACheng, YJacobsen, JAMcCammon, JACohen, SM Thioamide Hydroxypyrothiones Supersede Amide Hydroxypyrothiones in Potency against Anthrax Lethal Factor. J Med Chem 52:1063-74 (2009)  
Target
Name:
Lethal factor
Synonyms:
Anthrax Lethal Factor (LF) Antrax lethal toxin lef | lethal factor
Type:
PROTEIN
Mol. Mass.:
93758.56
Organism:
Bacillus anthracis
Description:
ChEMBL_1460338
Residue:
809
  
Inhibitor
Name:
BDBM27863
Synonyms:
3-hydroxy-N-[(2-methoxyphenyl)methyl]-4-sulfanylidene-4H-pyran-2-carboxamide | hydroxypyrothione amide, 5b
Type:
Small organic molecule
Emp. Form.:
C14H13NO4S
Mol. Mass.:
291.322
SMILES:
COc1ccccc1CNC(=O)c1occc(=S)c1O
:
Substrate
Name:
Fluorogenic LF Substrate
Synonyms:
Type:
Peptide
Mol. Mass.:
6797.59
Organism:
Description:
Cou = 7-Hydroxy-4-methyl-3-acetylcoumarinyl; QSY-35 = N-((4-((7-Nitro-2,1,3-benzoxzdiazol-4-yl)amino)phenyl)acetyl.
Residue:
61