Target
Stromelysin-1
Ligand
BDBM27877
Substrate
MMP-3 Fluorogenic Peptide Substrate
Meas. Tech.
Enzyme Assay and Determination of the Inhibition Constants IC50
pH
6±n/a
Temperature
295.15±n/a K
IC50
<100±n/a nM
Citation
 Pochetti, GMontanari, RGege, CChevrier, CTaveras, AGMazza, F Extra Binding Region Induced by Non-Zinc Chelating Inhibitors into the S(1)' Subsite of Matrix Metalloproteinase 8 (MMP-8) (dagger). J Med Chem 52:1040-9 (2009)  
Target
Name:
Stromelysin-1
Synonyms:
MMP-3 MMP3_HUMAN Matrix metalloproteinase 3 Matrix metalloproteinase-3 (MMP-3) SL-1 Stromelysin 1 | Transin-1
Type:
Enzyme
Mol. Mass.:
53973.13
Organism:
Homo sapiens (Human)
Description:
P08254
Residue:
477
  
Inhibitor
Name:
BDBM27877
Synonyms:
N-{[2-(2-amino-3,4-dioxocyclobut-1-en-1-yl)-1,2,3,4-tetrahydroisoquinolin-7-yl]methyl}-3,11,11-trioxo-8,1-dithia-4,6-diazatricyclo[7.4.0.0^{2,7}]trideca-1(9),2(7),5-triene-5-carboxamide | thiopyranothienopyrimidine, 1
Type:
Small organic molecule
Emp. Form.:
C24H21N5O6S2
Mol. Mass.:
539.583
SMILES:
Nc1c(N2CCc3ccc(CNC(=O)c4nc5sc6CS(=O)(=O)CCc6c5c(=O)[nH]4)cc3C2)c(=O)c1=O
:
Substrate
Name:
MMP-3 Fluorogenic Peptide Substrate
Synonyms:
NFF-3 substrate
Type:
Peptide
Mol. Mass.:
3799.85
Organism:
Description:
DNP = 2,4-dinitrophenyl; Nva = L-norvaline.
Residue:
35