Target
Matrilysin
Ligand
BDBM27878
Substrate
OmniMMP Substrate
Meas. Tech.
Enzyme Assay and Determination of the Inhibition Constants IC50
pH
7.5±n/a
Temperature
295.15±n/a K
IC50
>10000±n/a nM
Citation
 Pochetti, GMontanari, RGege, CChevrier, CTaveras, AGMazza, F Extra Binding Region Induced by Non-Zinc Chelating Inhibitors into the S(1)' Subsite of Matrix Metalloproteinase 8 (MMP-8) (dagger). J Med Chem 52:1040-9 (2009)  
Target
Name:
Matrilysin
Synonyms:
MMP7 MPSL1 Matrix metalloproteinase-7 (MMP-7) PUMP1
Type:
Enzyme
Mol. Mass.:
29681.54
Organism:
Homo sapiens (Human)
Description:
P09237
Residue:
267
  
Inhibitor
Name:
BDBM27878
Synonyms:
13-(carbamoylmethyl)-3-oxo-N-[(3-oxo-3,4-dihydro-2H-1,4-benzoxazin-6-yl)methyl]-8-thia-4,6-diazatricyclo[7.4.0.0^{2,7}]trideca-1(9),2(7),5-triene-5-carboxamide hexahydrobenzothienopyrimidine, 2
Type:
Small organic molecule
Emp. Form.:
C22H21N5O5S
Mol. Mass.:
467.498
SMILES:
NC(=O)CC1CCCc2sc3nc([nH]c(=O)c3c12)C(=O)NCc1ccc2OCC(=O)Nc2c1
:
Substrate
Name:
OmniMMP Substrate
Synonyms:
Type:
Peptide
Mol. Mass.:
2468.31
Organism:
Description:
Dpa = 3-(2,4-dinitrophenyl)-L-2,3-diaminopropionyl. It is From Biomol, Hamburg, Germany.
Residue:
23