Target
Bromodomain-containing protein 4 [42-168]
Ligand
BDBM391504
Substrate
Meas. Tech.
BRD4 AlphaScreen Assay
IC50
550±n/a nM
Citation
 Combs, APMaduskuie, Jr., TPFalahatpisheh, N 1H-pyrrolo[2,3,c]pyridin-7(6H)-ones and pyrazolo[3,4-c]pyridin-7(6H)-ones as inhibitors of BET proteins US Patent  US9957268 Publication Date 5/1/2018 
Target
Name:
Bromodomain-containing protein 4 [42-168]
Synonyms:
BRD4 BRD4_HUMAN HUNK1
Type:
Enzyme Catalytic Domain
Mol. Mass.:
15054.68
Organism:
Homo sapiens (Human)
Description:
O60885[42-168]
Residue:
127
  
Inhibitor
Name:
BDBM391504
Synonyms:
2-ethyl-8-(6-methyl-7-oxo- US10781209, Example 4 US11702416, Example 4 | US9957268, Example 4
Type:
Small organic molecule
Emp. Form.:
C18H17N3O3
Mol. Mass.:
323.3459
SMILES:
CCC1Oc2c(NC1=O)cccc2-c1cn(C)c(=O)c2[nH]ccc12
: