Target
Bromodomain-containing protein 4 [42-168]
Ligand
BDBM391595
Substrate
Meas. Tech.
BRD4 AlphaScreen Assay
IC50
<100±n/a nM
Citation
 Combs, APMaduskuie, Jr., TPFalahatpisheh, N 1H-pyrrolo[2,3,c]pyridin-7(6H)-ones and pyrazolo[3,4-c]pyridin-7(6H)-ones as inhibitors of BET proteins US Patent  US9957268 Publication Date 5/1/2018 
Target
Name:
Bromodomain-containing protein 4 [42-168]
Synonyms:
BRD4 BRD4_HUMAN HUNK1
Type:
Enzyme Catalytic Domain
Mol. Mass.:
15054.68
Organism:
Homo sapiens (Human)
Description:
O60885[42-168]
Residue:
127
  
Inhibitor
Name:
BDBM391595
Synonyms:
6-(1-hydroxyethyl)-2,2,4- trimethyl-8-(6-methyl-7-oxo- 6,7-dihydro-1H-pyrrolo[2,3- c]pyridin-4-yl)-2H-1,4- benzoxazin-3(4H)-one US10781209, Example 83 US11702416, Example 83 | US9957268, Example 83
Type:
Small organic molecule
Emp. Form.:
C21H23N3O4
Mol. Mass.:
381.425
SMILES:
CC(O)c1cc2N(C)C(=O)C(C)(C)Oc2c(c1)-c1cn(C)c(=O)c2[nH]ccc12
: