Target
Cyclin-dependent kinase 2/G1/S-specific cyclin-E1
Ligand
BDBM253925
Substrate
Meas. Tech.
Kinase Enzymatic Assay
IC50
50500±n/a nM
Citation
 Tavares, FXStrum, JC CDK inhibitors US Patent  US9957276 Publication Date 5/1/2018 
Target
Name:
Cyclin-dependent kinase 2/G1/S-specific cyclin-E1
Synonyms:
CDK2/CycE CDK2/E Cyclin-Dependent Kinase 2 (CDK2) Cyclin-dependent kinase 2/cyclin E1
Type:
Protein
Mol. Mass.:
Description:
Components:
This complex has 2 components.
Component 1
Name:
Cyclin-dependent kinase 2
Synonyms:
CDK2 CDK2_HUMAN Cell division protein kinase 2 Protein cereblon/Cyclin-dependent kinase 2 | p33 protein kinase
Type:
Enzyme Subunit
Mol. Mass.:
33938.17
Organism:
Homo sapiens (Human)
Description:
P24941
Residue:
298
  
Component 2
Name:
G1/S-specific cyclin-E1
Synonyms:
CCNE CCNE1_HUMAN
Type:
Enzyme Subunit
Mol. Mass.:
47073.17
Organism:
Homo sapiens (Human)
Description:
Residue:
410
  
Inhibitor
Name:
BDBM253925
Synonyms:
US10189849, Compound 28 US9464092, Q US9957276, Compound 28
Type:
Small organic molecule
Emp. Form.:
C23H28N8O
Mol. Mass.:
432.5214
SMILES:
O=C1NCC2(CCCCC2)n2c1cc1cnc(Nc3ccc(cn3)N3CCNCC3)nc21
: