Target
Cyclin-dependent kinase 2/G1/S-specific cyclin-E1
Ligand
BDBM331855
Substrate
Meas. Tech.
Kinase Enzymatic Assay
IC50
50500±n/a nM
Citation
 Tavares, FXStrum, JC CDK inhibitors US Patent  US9957276 Publication Date 5/1/2018 
Target
Name:
Cyclin-dependent kinase 2/G1/S-specific cyclin-E1
Synonyms:
CDK2/CycE CDK2/E Cyclin-Dependent Kinase 2 (CDK2) Cyclin-dependent kinase 2/cyclin E1
Type:
Protein
Mol. Mass.:
Description:
Components:
This complex has 2 components.
Component 1
Name:
Cyclin-dependent kinase 2
Synonyms:
CDK2 CDK2_HUMAN Cell division protein kinase 2 Protein cereblon/Cyclin-dependent kinase 2 | p33 protein kinase
Type:
Enzyme Subunit
Mol. Mass.:
33938.17
Organism:
Homo sapiens (Human)
Description:
P24941
Residue:
298
  
Component 2
Name:
G1/S-specific cyclin-E1
Synonyms:
CCNE CCNE1_HUMAN
Type:
Enzyme Subunit
Mol. Mass.:
47073.17
Organism:
Homo sapiens (Human)
Description:
Residue:
410
  
Inhibitor
Name:
BDBM331855
Synonyms:
US10189849, Compound 37 US9957276, Compound 37
Type:
Small organic molecule
Emp. Form.:
C24H29N7O2
Mol. Mass.:
447.5328
SMILES:
CC1CN(CC(C)O1)c1ccc(Nc2ncc3cc4C(=O)NCC5(CCCC5)n4c3n2)nc1
: