Target
E3 ubiquitin-protein ligase XIAP [241-356]
Ligand
BDBM27941
Substrate
BDBM17342
Meas. Tech.
Fluorescence Polarization Affinity Measurements
Ki
1600±n/a nM
Citation
 Cohen, FAlicke, BElliott, LOFlygare, JAGoncharov, TKeteltas, SFFranklin, MCFrankovitz, SStephan, JPTsui, VVucic, DWong, HFairbrother, WJ Orally bioavailable antagonists of inhibitor of apoptosis proteins based on an azabicyclooctane scaffold. J Med Chem 52:1723-30 (2009)  
Target
Name:
E3 ubiquitin-protein ligase XIAP [241-356]
Synonyms:
API3 BIRC4 E3 ubiquitin-protein ligase XIAP BIR-3 IAP3 X-linked inhibitor of apoptosis protein BIR3 domain (XIAP BIR-3) XIAP-BIR3 baculovirus IAP repeat 3 (BIR3) domain of XIAP
Type:
Protein Binding Domain
Mol. Mass.:
13276.62
Organism:
Homo sapiens (Human)
Description:
BIR3 of XIAP: RESIDUES 241-356.
Residue:
116
  
Inhibitor
Name:
BDBM27941
Synonyms:
N-{[(2S)-1-[(2S)-3,3-dimethyl-2-[(2S)-2-(methylamino)propanamido]butanoyl]pyrrolidin-2-yl]methyl}naphthalene-1-carboxamide | butoxycarbonylpyrrolidine derivative, 15b
Type:
Small organic molecule
Emp. Form.:
C26H36N4O3
Mol. Mass.:
452.589
SMILES:
CN[C@@H](C)C(=O)N[C@H](C(=O)N1CCC[C@H]1CNC(=O)c1cccc2ccccc12)C(C)(C)C
:
Substrate
Name:
BDBM17342
Synonyms:
5-carboxyflourescein(5-FAM)-conjugated AVPFFAKK | AVP-diPhe-FAM
Type:
Fluorescent dye-conjugated peptide
Emp. Form.:
Mol. Mass.:
SMILES:
: