Target
RAF proto-oncogene serine/threonine-protein kinase [1-324]
Ligand
BDBM202843
Substrate
MEK1 (K97R)
Meas. Tech.
Raf Activity Assay
pH
7.5±n/a
Temperature
298.15±n/a K
IC50
0.62±n/a nM
Comments
extracted
Citation
 Aversa, RJBarsanti, PABurger, MDillon, MPDipesa, AHu, CLou, YNishiguchi, GPan, YPolyakov, VRamurthy, SRico, ASetti, LSmith, ASubramanian, STaft, BTanner, HWan, LYusuff, N Biaryl amide compounds as kinase inhibitors US Patent  US9694016 Publication Date 7/4/2017 
Target
Name:
RAF proto-oncogene serine/threonine-protein kinase [1-324]
Synonyms:
C-Raf TR (aa 1-324) RAF RAF1_HUMAN
Type:
Mol. Mass.:
36996.69
Organism:
Homo sapiens (Human)
Description:
P04049 (1-324)
Residue:
324
  
Inhibitor
Name:
BDBM202843
Synonyms:
US10245267, Example 196 US9242969, 196 | US9694016, 196
Type:
Small organic molecule
Emp. Form.:
C25H24F3N3O3
Mol. Mass.:
471.4716
SMILES:
COc1cc(nc(c1)-c1cc(NC(=O)c2cccc(c2)C(F)(F)F)ccc1C)N1CCOCC1
:
Substrate
Name:
Dual specificity mitogen-activated protein kinase kinase 1 [K97R]
Synonyms:
Dual specificity mitogen-activated protein kinase kinase 1 (MEK1)(K97R) MEK1 MP2K1_HUMAN | PRKMK1
Type:
Mol. Mass.:
43467.04
Organism:
Homo sapiens (Human)
Description:
Biotinylated full length MEK1 with an inactivating K97R ATP binding site mutation.
Residue:
393