Target
RAF proto-oncogene serine/threonine-protein kinase [Y340E,Y341E]
Ligand
BDBM81177
Substrate
MEK1 (K97R)
Meas. Tech.
Raf Activity Assay
pH
7.5±n/a
Temperature
298.15±n/a K
IC50
0.10±n/a nM
Comments
extracted
Citation
 Aversa, RJBarsanti, PABurger, MDillon, MPDipesa, AHu, CLou, YNishiguchi, GPan, YPolyakov, VRamurthy, SRico, ASetti, LSmith, ASubramanian, STaft, BTanner, HWan, LYusuff, N Biaryl amide compounds as kinase inhibitors US Patent  US9694016 Publication Date 7/4/2017 
Target
Name:
RAF proto-oncogene serine/threonine-protein kinase [Y340E,Y341E]
Synonyms:
C-RAF RAF RAF1 | RAF1_HUMAN
Type:
Mol. Mass.:
73012.38
Organism:
Homo sapiens (Human)
Description:
P04049[Y340E,Y341E]
Residue:
648
  
Inhibitor
Name:
BDBM81177
Synonyms:
US10245267, Example 476 US9694016, 476
Type:
Small organic molecule
Emp. Form.:
C25H28N4O3
Mol. Mass.:
432.5148
SMILES:
CCc1cc(ccn1)C(=O)Nc1ccc(C)c(c1)-c1cc(N2CCOCC2)n(C)c(=O)c1
:
Substrate
Name:
Dual specificity mitogen-activated protein kinase kinase 1 [K97R]
Synonyms:
Dual specificity mitogen-activated protein kinase kinase 1 (MEK1)(K97R) MEK1 MP2K1_HUMAN | PRKMK1
Type:
Mol. Mass.:
43467.04
Organism:
Homo sapiens (Human)
Description:
Biotinylated full length MEK1 with an inactivating K97R ATP binding site mutation.
Residue:
393