Target
RAF proto-oncogene serine/threonine-protein kinase [Y340E,Y341E]
Ligand
BDBM87922
Substrate
MEK1 (K97R)
Meas. Tech.
Raf Activity Assay
pH
7.5±n/a
Temperature
298.15±n/a K
IC50
0.11±n/a nM
Comments
extracted
Citation
 Aversa, RJBarsanti, PABurger, MDillon, MPDipesa, AHu, CLou, YNishiguchi, GPan, YPolyakov, VRamurthy, SRico, ASetti, LSmith, ASubramanian, STaft, BTanner, HWan, LYusuff, N Biaryl amide compounds as kinase inhibitors US Patent  US9694016 Publication Date 7/4/2017 
Target
Name:
RAF proto-oncogene serine/threonine-protein kinase [Y340E,Y341E]
Synonyms:
C-RAF RAF RAF1 | RAF1_HUMAN
Type:
Mol. Mass.:
73012.38
Organism:
Homo sapiens (Human)
Description:
P04049[Y340E,Y341E]
Residue:
648
  
Inhibitor
Name:
BDBM87922
Synonyms:
US10245267, Example 951 US9694016, 951
Type:
Small organic molecule
Emp. Form.:
C26H27F3N4O3
Mol. Mass.:
500.5128
SMILES:
CC(C)Oc1ncc(cc1N1CCOCC1)-c1cc(NC(=O)c2cncc(c2)C(F)(F)F)ccc1C
:
Substrate
Name:
Dual specificity mitogen-activated protein kinase kinase 1 [K97R]
Synonyms:
Dual specificity mitogen-activated protein kinase kinase 1 (MEK1)(K97R) MEK1 MP2K1_HUMAN | PRKMK1
Type:
Mol. Mass.:
43467.04
Organism:
Homo sapiens (Human)
Description:
Biotinylated full length MEK1 with an inactivating K97R ATP binding site mutation.
Residue:
393