Target
Epidermal growth factor receptor
Ligand
BDBM27974
Substrate
Biotinylated EGFR Peptide Substrate
Meas. Tech.
Receptor Tyrosine Kinase Inhibition Assay
pH
7.5±n/a
Temperature
296.15±n/a K
IC50
47±n/a nM
Citation
 Wood, ERShewchuk, LMEllis, BBrignola, PBrashear, RLCaferro, TRDickerson, SHDickson, HDDonaldson, KHGaul, MGriffin, RJHassell, AMKeith, BMullin, RPetrov, KGReno, MJRusnak, DWTadepalli, SMUlrich, JCWagner, CDVanderwall, DEWaterson, AGWilliams, JDWhite, WLUehling, DE 6-Ethynylthieno[3,2-d]- and 6-ethynylthieno[2,3-d]pyrimidin-4-anilines as tunable covalent modifiers of ErbB kinases. Proc Natl Acad Sci U S A 105:2773-8 (2008)  
Target
Name:
Epidermal growth factor receptor
Synonyms:
EGF Receptor Substrate EGFR_HUMAN ERBB1 Epidermal Growth Factor Receptor erbB-1 Epidermal growth factor receptor (EGFR) HER1 Proto-oncogene c-ErbB-1 Tyrosine-Protein Kinase ErbB-1
Type:
Receptor Kinase Domain
Mol. Mass.:
134279.59
Organism:
Homo sapiens (Human)
Description:
P00533
Residue:
1210
  
Inhibitor
Name:
BDBM27974
Synonyms:
5-{2-[4-({3-chloro-4-[(3-fluorophenyl)methoxy]phenyl}amino)thieno[3,2-d]pyrimidin-6-yl]ethynyl}pyrazin-2-amine | 6-Ethynylthieno[3,2-d]pyrimidine, 9
Type:
Small organic molecule
Emp. Form.:
C25H16ClFN6OS
Mol. Mass.:
502.951
SMILES:
Nc1cnc(cn1)C#Cc1cc2ncnc(Nc3ccc(OCc4cccc(F)c4)c(Cl)c3)c2s1
:
Substrate
Name:
Biotinylated EGFR Peptide Substrate
Synonyms:
Type:
Peptide
Mol. Mass.:
3934.43
Organism:
Description:
Residue:
34