Target
Epidermal growth factor receptor
Ligand
BDBM5445
Substrate
Biotinylated EGFR Peptide Substrate
Meas. Tech.
Receptor Tyrosine Kinase Inhibition Assay
pH
7.5±n/a
Temperature
296.15±n/a K
IC50
11±n/a nM
Comments
Literature data.
Citation
 Wood, ERShewchuk, LMEllis, BBrignola, PBrashear, RLCaferro, TRDickerson, SHDickson, HDDonaldson, KHGaul, MGriffin, RJHassell, AMKeith, BMullin, RPetrov, KGReno, MJRusnak, DWTadepalli, SMUlrich, JCWagner, CDVanderwall, DEWaterson, AGWilliams, JDWhite, WLUehling, DE 6-Ethynylthieno[3,2-d]- and 6-ethynylthieno[2,3-d]pyrimidin-4-anilines as tunable covalent modifiers of ErbB kinases. Proc Natl Acad Sci U S A 105:2773-8 (2008)  
Target
Name:
Epidermal growth factor receptor
Synonyms:
EGF Receptor Substrate EGFR_HUMAN ERBB1 Epidermal Growth Factor Receptor erbB-1 Epidermal growth factor receptor (EGFR) HER1 Proto-oncogene c-ErbB-1 Tyrosine-Protein Kinase ErbB-1
Type:
Receptor Kinase Domain
Mol. Mass.:
134279.59
Organism:
Homo sapiens (Human)
Description:
P00533
Residue:
1210
  
Inhibitor
Name:
BDBM5445
Synonyms:
CHEMBL554 LAPATINIB DITOSYLATE N-{3-chloro-4-[(3-fluoro-benzyl)oxy]phenyl}-6-[5-({2-(methylsulfonyl)ethyl]amino}methyl)-2-furyl]-4-quinazolinamine Tykerb US10822334, Compound Lapatinib cid_208908
Type:
Small organic molecule
Emp. Form.:
C29H26ClFN4O4S
Mol. Mass.:
581.058
SMILES:
CS(=O)(=O)CCNCc1ccc(o1)-c1ccc2ncnc(Nc3ccc(OCc4cccc(F)c4)c(Cl)c3)c2c1
:
Substrate
Name:
Biotinylated EGFR Peptide Substrate
Synonyms:
Type:
Peptide
Mol. Mass.:
3934.43
Organism:
Description:
Residue:
34