Target
Receptor tyrosine-protein kinase erbB-2
Ligand
BDBM27976
Substrate
Biotinylated ErbB-2 Peptide Substrate
Meas. Tech.
Receptor Tyrosine Kinase Inhibition Assay
pH
7.5±n/a
Temperature
296.15±n/a K
IC50
44±n/a nM
Citation
 Wood, ERShewchuk, LMEllis, BBrignola, PBrashear, RLCaferro, TRDickerson, SHDickson, HDDonaldson, KHGaul, MGriffin, RJHassell, AMKeith, BMullin, RPetrov, KGReno, MJRusnak, DWTadepalli, SMUlrich, JCWagner, CDVanderwall, DEWaterson, AGWilliams, JDWhite, WLUehling, DE 6-Ethynylthieno[3,2-d]- and 6-ethynylthieno[2,3-d]pyrimidin-4-anilines as tunable covalent modifiers of ErbB kinases. Proc Natl Acad Sci U S A 105:2773-8 (2008)  
Target
Name:
Receptor tyrosine-protein kinase erbB-2
Synonyms:
2.7.10.1 CD_antigen=CD340 ERBB2_HUMAN FASN/HER2 HER2 MLN19 NEU Proto-oncogene Neu Tyrosine kinase-type cell surface receptor HER2 | p185erbB2
Type:
Mol. Mass.:
137894.47
Organism:
Homo sapiens (Human)
Description:
P04626
Residue:
1255
  
Inhibitor
Name:
BDBM27976
Synonyms:
6-Ethynylthieno[2,3-d]pyrimidine, 11 | 6-[(3S)-3-aminobut-1-yn-1-yl]-N-{3-chloro-4-[(3-fluorophenyl)methoxy]phenyl}thieno[2,3-d]pyrimidin-4-amine
Type:
Small organic molecule
Emp. Form.:
C23H18ClFN4OS
Mol. Mass.:
452.932
SMILES:
C[C@H](N)C#Cc1cc2c(Nc3ccc(OCc4cccc(F)c4)c(Cl)c3)ncnc2s1
:
Substrate
Name:
Biotinylated ErbB-2 Peptide Substrate
Synonyms:
Type:
Peptide
Mol. Mass.:
4131.76
Organism:
Description:
Residue:
37