Target
Lysine-specific histone demethylase 1A
Ligand
BDBM391633
Substrate
Meas. Tech.
LSD1 Histone Demethylase Biochemical Assay
IC50
<100±n/a nM
Citation
 Wu, LCourter, JRHe, CShen, BWang, XYao, WZhang, F Cyclopropylamines as LSD1 inhibitors US Patent  US10300051 Publication Date 5/28/2019 
Target
Name:
Lysine-specific histone demethylase 1A
Synonyms:
AOF2 Flavin-containing amine oxidase domain-containing protein 2 KDM1A KIAA0601 Lysine-specific demethylase 1 (LSD1) Lysine-specific histone demethylase 1 (LSD1)
Type:
Enzyme
Mol. Mass.:
92901.01
Organism:
Homo sapiens (Human)
Description:
O60341
Residue:
852
  
Inhibitor
Name:
BDBM391633
Synonyms:
Methyl 4-(cyanomethyl)-4-{[(trans-2-phenylcyclopropyl)amino]methyl}piperidine-1-carboxylate | US10300051, Example 2
Type:
Small organic molecule
Emp. Form.:
C19H25N3O2
Mol. Mass.:
327.4207
SMILES:
COC(=O)N1CCC(CNC2CC2c2ccccc2)(CC#N)CC1
: