Target
Lysine-specific histone demethylase 1A
Ligand
BDBM391666
Substrate
Meas. Tech.
LSD1 Histone Demethylase Biochemical Assay
IC50
<100±n/a nM
Citation
 Wu, LCourter, JRHe, CShen, BWang, XYao, WZhang, F Cyclopropylamines as LSD1 inhibitors US Patent  US10300051 Publication Date 5/28/2019 
Target
Name:
Lysine-specific histone demethylase 1A
Synonyms:
AOF2 Flavin-containing amine oxidase domain-containing protein 2 KDM1A KIAA0601 Lysine-specific demethylase 1 (LSD1) Lysine-specific histone demethylase 1 (LSD1)
Type:
Enzyme
Mol. Mass.:
92901.01
Organism:
Homo sapiens (Human)
Description:
O60341
Residue:
852
  
Inhibitor
Name:
BDBM391666
Synonyms:
(1S,2R)—N-{[4-(4-fluorobenzyl)piperidin-4-yl]methyl}-2-phenylcyclopropanamine | US10300051, Example 12
Type:
Small organic molecule
Emp. Form.:
C22H27FN2
Mol. Mass.:
338.4616
SMILES:
Fc1ccc(CC2(CN[C@H]3C[C@@H]3c3ccccc3)CCNCC2)cc1
: