Target
Lysine-specific histone demethylase 1A
Ligand
BDBM391692
Substrate
Meas. Tech.
LSD1 Histone Demethylase Biochemical Assay
IC50
<100±n/a nM
Citation
 Wu, LCourter, JRHe, CShen, BWang, XYao, WZhang, F Cyclopropylamines as LSD1 inhibitors US Patent  US10300051 Publication Date 5/28/2019 
Target
Name:
Lysine-specific histone demethylase 1A
Synonyms:
AOF2 Flavin-containing amine oxidase domain-containing protein 2 KDM1A KIAA0601 Lysine-specific demethylase 1 (LSD1) Lysine-specific histone demethylase 1 (LSD1)
Type:
Enzyme
Mol. Mass.:
92901.01
Organism:
Homo sapiens (Human)
Description:
O60341
Residue:
852
  
Inhibitor
Name:
BDBM391692
Synonyms:
3-[4-[(3-fluorophenoxy)methyl]-4-({[(1R,2S)-2-phenylcyclopropyl]amino}methyl)piperidin-1-yl]propanoic Acid | US10300051, Example 38
Type:
Small organic molecule
Emp. Form.:
C25H31FN2O3
Mol. Mass.:
426.5236
SMILES:
OC(=O)CCN1CCC(CN[C@@H]2CC2c2ccccc2)(COc2cccc(F)c2)CC1
: