Target
Lysine-specific histone demethylase 1A
Ligand
BDBM391699
Substrate
Meas. Tech.
LSD1 Histone Demethylase Biochemical Assay
IC50
<100±n/a nM
Citation
 Wu, LCourter, JRHe, CShen, BWang, XYao, WZhang, F Cyclopropylamines as LSD1 inhibitors US Patent  US10300051 Publication Date 5/28/2019 
Target
Name:
Lysine-specific histone demethylase 1A
Synonyms:
AOF2 Flavin-containing amine oxidase domain-containing protein 2 KDM1A KIAA0601 Lysine-specific demethylase 1 (LSD1) Lysine-specific histone demethylase 1 (LSD1)
Type:
Enzyme
Mol. Mass.:
92901.01
Organism:
Homo sapiens (Human)
Description:
O60341
Residue:
852
  
Inhibitor
Name:
BDBM391699
Synonyms:
3-[4-{[(5-fluoropyridin-2-yl)oxy]methyl}-4-({[(1R,2S)-2-phenylcyclopropyl]amino}methyl)piperidin-1-yl]propanoic Acid | US10300051, Example 45
Type:
Small organic molecule
Emp. Form.:
C24H30FN3O3
Mol. Mass.:
427.5117
SMILES:
OC(=O)CCN1CCC(CN[C@@H]2CC2c2ccccc2)(COc2ccc(F)cn2)CC1
: