Target
Lysine-specific histone demethylase 1A
Ligand
BDBM391711
Substrate
Meas. Tech.
LSD1 Histone Demethylase Biochemical Assay
IC50
<100±n/a nM
Citation
 Wu, LCourter, JRHe, CShen, BWang, XYao, WZhang, F Cyclopropylamines as LSD1 inhibitors US Patent  US10300051 Publication Date 5/28/2019 
Target
Name:
Lysine-specific histone demethylase 1A
Synonyms:
AOF2 Flavin-containing amine oxidase domain-containing protein 2 KDM1A KIAA0601 Lysine-specific demethylase 1 (LSD1) Lysine-specific histone demethylase 1 (LSD1)
Type:
Enzyme
Mol. Mass.:
92901.01
Organism:
Homo sapiens (Human)
Description:
O60341
Residue:
852
  
Inhibitor
Name:
BDBM391711
Synonyms:
3-{[1-[(dimethylamino)acetyl]-4-({[(1R,2S)-2-phenylcyclopropyl]amino}methyl)piperidin-4-yl]methyl}benzonitrile | US10300051, Example 57
Type:
Small organic molecule
Emp. Form.:
C27H34N4O
Mol. Mass.:
430.5851
SMILES:
CN(C)CC(=O)N1CCC(CN[C@@H]2CC2c2ccccc2)(Cc2cccc(c2)C#N)CC1
: