Target
Epidermal growth factor receptor
Ligand
BDBM391734
Substrate
Meas. Tech.
Assay on In Vitro Enzyme-Inhibiting Activity
IC50
640±n/a nM
Citation
 Wu, F Tyrosine kinase inhibitor and uses thereof US Patent  US10300058 Publication Date 5/28/2019 
Target
Name:
Epidermal growth factor receptor
Synonyms:
EGF Receptor Substrate EGFR_HUMAN ERBB1 Epidermal Growth Factor Receptor erbB-1 Epidermal growth factor receptor (EGFR) HER1 Proto-oncogene c-ErbB-1 Tyrosine-Protein Kinase ErbB-1
Type:
Receptor Kinase Domain
Mol. Mass.:
134279.59
Organism:
Homo sapiens (Human)
Description:
P00533
Residue:
1210
  
Inhibitor
Name:
BDBM391734
Synonyms:
N-(3-((2-((2-acetyl-7-methoxy-1,2,3,4-tetrahydroisoquinolin-6-yl)amino)-5-(trifluoromethyl)pyrimidin-4-yl)amino)phenyl)acrylamide | US10300058, Compound 11
Type:
Small organic molecule
Emp. Form.:
C26H25F3N6O3
Mol. Mass.:
526.5103
SMILES:
COc1cc2CN(CCc2cc1Nc1ncc(c(Nc2cccc(NC(=O)C=C)c2)n1)C(F)(F)F)C(C)=O
: