Target
High affinity nerve growth factor receptor
Ligand
BDBM249317
Substrate
Meas. Tech.
Measurement of TrkA Kinase-Inhibiting Activity Using Human TrkA-Expressing Cells
IC50
2.00±n/a nM
Citation
 Takeuchi, JItadani, SHashimura, KIkura, MHigashino, MYasuhiro, TNagaura, T Trk-inhibiting compound US Patent  US10300060 Publication Date 5/28/2019 
Target
Name:
High affinity nerve growth factor receptor
Synonyms:
2.7.10.1 NTRK1 NTRK1_HUMAN Neurotrophic tyrosine kinase receptor type 1 Synonyms=MTC TRK1-transforming tyrosine kinase protein TRKA GN Tropomyosin alpha-3 chain/High affinity nerve growth factor receptor Tropomyosin-related kinase A (TrkA) Tyrosine kinase receptor (Trk) Tyrosine kinase receptor A (Trk A) Tyrosine kinase receptor A (TrkA) p140-TrkA
Type:
Mol. Mass.:
87498.18
Organism:
Homo sapiens (Human)
Description:
P04629
Residue:
796
  
Inhibitor
Name:
BDBM249317
Synonyms:
US10300060, Example 8-2 US9463192, 8-2 US9993479, 8-2
Type:
Small organic molecule
Emp. Form.:
C27H17ClF6N8O2
Mol. Mass.:
634.92
SMILES:
Nc1ncc(Cl)cc1-c1ccc(Oc2ncc(NC(=O)Nc3cc(ccc3-n3ccc(n3)C(F)(F)F)C(F)(F)F)cn2)cc1
: