Target
High affinity nerve growth factor receptor
Ligand
BDBM249325
Substrate
Meas. Tech.
Measurement of TrkA Kinase-Inhibiting Activity Using Human TrkA-Expressing Cells
IC50
1.000±n/a nM
Citation
 Takeuchi, JItadani, SHashimura, KIkura, MHigashino, MYasuhiro, TNagaura, T Trk-inhibiting compound US Patent  US10300060 Publication Date 5/28/2019 
Target
Name:
High affinity nerve growth factor receptor
Synonyms:
2.7.10.1 NTRK1 NTRK1_HUMAN Neurotrophic tyrosine kinase receptor type 1 Synonyms=MTC TRK1-transforming tyrosine kinase protein TRKA GN Tropomyosin alpha-3 chain/High affinity nerve growth factor receptor Tropomyosin-related kinase A (TrkA) Tyrosine kinase receptor (Trk) Tyrosine kinase receptor A (Trk A) Tyrosine kinase receptor A (TrkA) p140-TrkA
Type:
Mol. Mass.:
87498.18
Organism:
Homo sapiens (Human)
Description:
P04629
Residue:
796
  
Inhibitor
Name:
BDBM249325
Synonyms:
US10300060, Example 15-4 US9463192, 15-4 US9993479, 15-4
Type:
Small organic molecule
Emp. Form.:
C26H18ClF3N8O2
Mol. Mass.:
566.922
SMILES:
Nc1ncc(Cl)cc1-c1ccc(Oc2ncc(NC(=O)Nc3ccc(cc3-n3cccn3)C(F)(F)F)cn2)cc1
: