Target
Tyrosine-protein kinase BTK
Ligand
BDBM260538
Substrate
Meas. Tech.
Inhibition Assay of BTK Kinase Activity
IC50
2.00±n/a nM
Citation
 He, W Polyfluorinated compounds acting as bruton tyrosine kinase inhibitors US Patent  US10300066 Publication Date 5/28/2019 
Target
Name:
Tyrosine-protein kinase BTK
Synonyms:
AGMX1 Agammaglobulinaemia tyrosine kinase B cell progenitor kinase BPK BTK_HUMAN Tyrosine Kinase BTK Tyrosine-protein kinase BTK (BTK)
Type:
Enzyme
Mol. Mass.:
76289.95
Organism:
Homo sapiens (Human)
Description:
Q06187
Residue:
659
  
Inhibitor
Name:
BDBM260538
Synonyms:
US10300066, Compound 12 | US9532990, 12
Type:
Small organic molecule
Emp. Form.:
C25H21F2N7O4
Mol. Mass.:
521.4755
SMILES:
Nc1ncnc2n(nc(-c3ccc(Oc4cccc(F)c4[N+]([O-])=O)cc3F)c12)C1CCCN(C1)C(=O)C=C
: