Target
Tyrosine-protein kinase BTK
Ligand
BDBM260643
Substrate
Meas. Tech.
Inhibition Assay of BTK Kinase Activity
IC50
712±n/a nM
Citation
 He, W Polyfluorinated compounds acting as bruton tyrosine kinase inhibitors US Patent  US10300066 Publication Date 5/28/2019 
Target
Name:
Tyrosine-protein kinase BTK
Synonyms:
AGMX1 Agammaglobulinaemia tyrosine kinase B cell progenitor kinase BPK BTK_HUMAN Tyrosine Kinase BTK Tyrosine-protein kinase BTK (BTK)
Type:
Enzyme
Mol. Mass.:
76289.95
Organism:
Homo sapiens (Human)
Description:
Q06187
Residue:
659
  
Inhibitor
Name:
BDBM260643
Synonyms:
US10300066, Compound 117 | US9532990, 117
Type:
Small organic molecule
Emp. Form.:
C23H15F5N6O4
Mol. Mass.:
534.395
SMILES:
Nc1ncnc2n(nc(-c3ccc(Oc4c(F)c(F)cc(F)c4F)cc3F)c12)[C@@H]1CCN(C1)C(=O)C(O)=O
: