Target
Androgen receptor
Ligand
BDBM391766
Substrate
Meas. Tech.
Antagonist Activity for AR
IC50
360±n/a nM
Citation
 Minamiguchi, KOkajima, SAoki, SAsai, MAsai, TYamanaka, HDohi, S Tetrahydropyridopyrimidine compound or salt thereof US Patent  US10300067 Publication Date 5/28/2019 
Target
Name:
Androgen receptor
Synonyms:
ANDR_HUMAN Androgen Receptor Androgen receptor/Baculoviral IAP repeat-containing protein 2 Dihydrotestosterone receptor Nuclear receptor subfamily 3 group C member 4
Type:
Receptor
Mol. Mass.:
99185.27
Organism:
Homo sapiens (Human)
Description:
CHO cells were stably transfected with human AR gene.
Residue:
920
  
Inhibitor
Name:
BDBM391766
Synonyms:
4-(4-((4-(3-(4-(Methylsulfonyl)piperazin-1-yl)propoxy)phenyl)amino)-5,6-dihydropyrido[3,4-d]pyrimidin-7(8H)-yl)-2-(trifluoromethyl)benzonitrile | US10300067, Example 18
Type:
Small organic molecule
Emp. Form.:
C29H32F3N7O3S
Mol. Mass.:
615.67
SMILES:
CS(=O)(=O)N1CCN(CCCOc2ccc(Nc3ncnc4CN(CCc34)c3ccc(C#N)c(c3)C(F)(F)F)cc2)CC1
: