Target
Baculoviral IAP repeat-containing protein 7
Ligand
BDBM391806
Substrate
Meas. Tech.
Biological Assays
Ki
<25000±n/a nM
Citation
 Pache, LChanda, SKVamos, MDCosford, NDTeriete, PMarlett, JDiaz, AYoung, JA Use of inhibitor of apoptosis protein (IAP) antagonists in HIV therapy US Patent  US10300074 Publication Date 5/28/2019 
Target
Name:
Baculoviral IAP repeat-containing protein 7
Synonyms:
BIR3 BIRC7_HUMAN KIAP MLIAP | RNF50
Type:
PROTEIN
Mol. Mass.:
32792.04
Organism:
Homo sapiens (Human)
Description:
ChEMBL_624591
Residue:
298
  
Inhibitor
Name:
BDBM391806
Synonyms:
US10300074, Product 17c | US11111270, Compound 35
Type:
Small organic molecule
Emp. Form.:
C25H36N4O3S
Mol. Mass.:
472.643
SMILES:
CN[C@@H](C)C(=O)N[C@H]1CCS[C@H]2CC(C)(C)C(N2C1=O)C(=O)N[C@@H]1CCCc2ccccc12
: