Target
E3 ubiquitin-protein ligase XIAP [1-168]/[124-242]
Ligand
BDBM391815
Substrate
Meas. Tech.
Biological Assays
Ki
>50000±n/a nM
Citation
 Pache, LChanda, SKVamos, MDCosford, NDTeriete, PMarlett, JDiaz, AYoung, JA Use of inhibitor of apoptosis protein (IAP) antagonists in HIV therapy US Patent  US10300074 Publication Date 5/28/2019 
Target
Name:
E3 ubiquitin-protein ligase XIAP [1-168]/[124-242]
Synonyms:
XIAP BIR1/2
Type:
Protein
Mol. Mass.:
Description:
Components:
This complex has 2 components.
Component 1
Name:
E3 ubiquitin-protein ligase XIAP [1-168]
Synonyms:
API3 IAP3 XIAP BIR1 | XIAP_HUMAN
Type:
Enzyme Catalytic Domain
Mol. Mass.:
18844.56
Organism:
Homo sapiens (Human)
Description:
P98170[1-168]
Residue:
168
  
Component 2
Name:
E3 ubiquitin-protein ligase XIAP [124-242]
Synonyms:
API3 IAP3 XIAP BIR2 | XIAP_HUMAN
Type:
Mol. Mass.:
13841.77
Organism:
Homo sapiens (Human)
Description:
P98170[124-242]
Residue:
119
  
Inhibitor
Name:
BDBM391815
Synonyms:
US10300074, Compd 11 | US11111270, Compound 11
Type:
Small organic molecule
Emp. Form.:
C23H28N4O4
Mol. Mass.:
424.4928
SMILES:
CN[C@@H](C)C(=O)N[C@H]1[C@@H](C)O[C@H]2CCC(N2C1=O)C(=O)Nc1cccc2ccccc12
: