Target
Dimer of Gag-Pol polyprotein [489-587]
Ligand
BDBM1163
Substrate
Fluorogenic Peptide Substrate
Meas. Tech.
Protease Inhibition Assay
pH
5±n/a
Temperature
303.15±n/a K
Ki
23±n/a nM
Citation
 Schaal, WKarlsson, AAhlsen, GLindberg, JAndersson, HODanielson, UHClasson, BUnge, TSamuelsson, BHulten, JHallberg, AKarlen, A Synthesis and comparative molecular field analysis (CoMFA) of symmetric and nonsymmetric cyclic sulfamide HIV-1 protease inhibitors. J Med Chem 44:155-69 (2001)  
Target
Name:
Dimer of Gag-Pol polyprotein [489-587]
Synonyms:
HIV-1 Protease
Type:
Protein Complex
Mol. Mass.:
Description:
Components:
This complex has 2 components.
Component 1
Name:
Gag-Pol polyprotein [489-587]
Synonyms:
HIV protease HIV-1 Protease chain A POL_HV1N5 | gag-pol
Type:
Enzyme Subunit
Mol. Mass.:
10822.21
Organism:
Human immunodeficiency virus type 1
Description:
P12497[489-587]
Residue:
99
  
Component 2
Name:
Gag-Pol polyprotein [489-587]
Synonyms:
HIV protease HIV-1 Protease chain A POL_HV1N5 | gag-pol
Type:
Enzyme Subunit
Mol. Mass.:
10822.21
Organism:
Human immunodeficiency virus type 1
Description:
P12497[489-587]
Residue:
99
  
Inhibitor
Name:
BDBM1163
Synonyms:
(3R,4S,5S,6R)-2,7-Dibenzyl-3,6-bis(phenoxymethyl)-4,5-dihydroxy-1,2,7-thiadiazepan 1,1-Dioxide CHEMBL130998 Cyclic Sulfamide deriv. 19
Type:
Small organic molecule
Emp. Form.:
C32H34N2O6S
Mol. Mass.:
574.687
SMILES:
O[C@@H]1[C@@H](O)[C@@H](COc2ccccc2)N(Cc2ccccc2)S(=O)(=O)N(Cc2ccccc2)[C@@H]1COc1ccccc1
:
Substrate
Name:
Fluorogenic Peptide Substrate
Synonyms:
Type:
Peptide
Mol. Mass.:
4156.59
Organism:
Description:
Residue:
39