Target
Lysine-specific histone demethylase 1A
Ligand
BDBM391892
Substrate
Meas. Tech.
Biochemical Assay for LSD1 Activity (15 minutes)
IC50
25.1±n/a nM
Citation
 Albrecht, BKAudia, JECote, ADuplessis, MGehling, VSGood, ACHarmange, JLeBlanc, YNasveschuk, CGTaylor, AMVaswani, RG Therapeutic compounds and uses thereof US Patent  US10301253 Publication Date 5/28/2019 
Target
Name:
Lysine-specific histone demethylase 1A
Synonyms:
AOF2 Flavin-containing amine oxidase domain-containing protein 2 KDM1A KIAA0601 Lysine-specific demethylase 1 (LSD1) Lysine-specific histone demethylase 1 (LSD1)
Type:
Enzyme
Mol. Mass.:
92901.01
Organism:
Homo sapiens (Human)
Description:
O60341
Residue:
852
  
Inhibitor
Name:
BDBM391892
Synonyms:
N-((1-methylpiperidin-4- yl)methyl)-2',3'- dihydrospiro[cyclopropane- 1,1'-inden]-2-amine | US10301253, Example 42
Type:
Small organic molecule
Emp. Form.:
C18H26N2
Mol. Mass.:
270.4124
SMILES:
CN1CCC(CNC2CC22CCc3ccccc23)CC1
: