Target
Lysine-specific histone demethylase 1A
Ligand
BDBM391925
Substrate
Meas. Tech.
Biochemical Assay for LSD1 Activity (50 minutes)
IC50
67.3±n/a nM
Citation
 Albrecht, BKAudia, JECote, ADuplessis, MGehling, VSGood, ACHarmange, JLeBlanc, YNasveschuk, CGTaylor, AMVaswani, RG Therapeutic compounds and uses thereof US Patent  US10301253 Publication Date 5/28/2019 
Target
Name:
Lysine-specific histone demethylase 1A
Synonyms:
AOF2 Flavin-containing amine oxidase domain-containing protein 2 KDM1A KIAA0601 Lysine-specific demethylase 1 (LSD1) Lysine-specific histone demethylase 1 (LSD1)
Type:
Enzyme
Mol. Mass.:
92901.01
Organism:
Homo sapiens (Human)
Description:
O60341
Residue:
852
  
Inhibitor
Name:
BDBM391925
Synonyms:
N1-(6''-chloro-2'',3''- dihydrospiro[cyclopropane- 1,1''-inden]-2- yl)cyclohexane-1,4- diamine US10301253, Example 78 US10301253, Example 80
Type:
Small organic molecule
Emp. Form.:
C17H23ClN2
Mol. Mass.:
290.831
SMILES:
NC1CCC(CC1)NC1CC11CCc2ccc(Cl)cc12
: