Target
N-formyl peptide receptor 2
Ligand
BDBM391978
Substrate
Meas. Tech.
FLIPR assay
EC50
1212±n/a nM
Citation
 Beard, RLDuong, TTGarst, ME Imidazole derivatives as formyl peptide receptor modulators US Patent  US10301269 Publication Date 5/28/2019 
Target
Name:
N-formyl peptide receptor 2
Synonyms:
ALXR, FPRL1, FPR2 FPR2 FPRH1 Formyl Peptide Receptor-Like 1 LXA4 receptor Lipoxin A4 receptor RFP | hFPRL
Type:
G Protein-Coupled Receptor (GPCR)
Mol. Mass.:
38968.35
Organism:
Homo sapiens (Human)
Description:
P25090
Residue:
351
  
Inhibitor
Name:
BDBM391978
Synonyms:
Ethyl 3-[2-(1-{[(4- Bromophenyl)carbamoyl] amino}propyl)-1H- imidazol-1- yl]propanoate US10800744, Number 23
Type:
Small organic molecule
Emp. Form.:
C18H23BrN4O3
Mol. Mass.:
423.304
SMILES:
CCOC(=O)CCn1ccnc1C(CC)NC(=O)Nc1ccc(Br)cc1
: