Target
N-formyl peptide receptor 2
Ligand
BDBM391984
Substrate
Meas. Tech.
FLIPR assay
EC50
9.00±n/a nM
Citation
 Beard, RLDuong, TTGarst, ME Imidazole derivatives as formyl peptide receptor modulators US Patent  US10301269 Publication Date 5/28/2019 
Target
Name:
N-formyl peptide receptor 2
Synonyms:
ALXR, FPRL1, FPR2 FPR2 FPRH1 Formyl Peptide Receptor-Like 1 LXA4 receptor Lipoxin A4 receptor RFP | hFPRL
Type:
G Protein-Coupled Receptor (GPCR)
Mol. Mass.:
38968.35
Organism:
Homo sapiens (Human)
Description:
P25090
Residue:
351
  
Inhibitor
Name:
BDBM391984
Synonyms:
1-(4-Chlorophenyl)-3- [(1S)-1-(1H-imidazol-2- yl)-2-methylpropyl]urea US10800744, Number 29
Type:
Small organic molecule
Emp. Form.:
C14H17ClN4O
Mol. Mass.:
292.764
SMILES:
CC(C)[C@H](NC(=O)Nc1ccc(Cl)cc1)c1ncc[nH]1
: